FS#39347 - [libmemcached] build fails

Attached to Project: Community Packages
Opened by Joel Teichroeb (klusark) - Tuesday, 11 March 2014, 15:02 GMT
Last edited by Evangelos Foutras (foutrelis) - Wednesday, 02 July 2014, 14:39 GMT
Task Type Bug Report
Category Packages
Status Closed
Assigned To Evangelos Foutras (foutrelis)
Architecture All
Severity Low
Priority Normal
Reported Version
Due in Version Undecided
Due Date Undecided
Percent Complete 100%
Votes 0
Private No



CC libmemcached-1.0/t/c_test.o
CC libmemcached-1.0/t/c_sasl_test.o
CXX libmemcached-1.0/t/cc_test.o
CXX tests/tests_cycle-cycle.o
CXX tests/libmemcached-1.0/tests_libmemcached_1_0_internals-internals.o
CXX tests/libmemcached-1.0/tests_libmemcached_1_0_internals-string.o
CXXLD libhashkit/libhashkit.la
CXXLD libmemcached/libmemcached.la
copying selected object files to avoid basename conflicts...
CXXLD clients/libutilities.la
CXXLD libmemcachedinternal/libmemcachedutilinternal.la
CCLD libmemcached-1.0/t/c_test
CCLD libmemcached-1.0/t/c_sasl_test
CXXLD libmemcached-1.0/t/cc_test
CXXLD libmemcached/libmemcachedutil.la
CXXLD libtest/libtest.la
libmemcached/.libs/libmemcached.so: undefined reference to `pthread_once'
collect2: error: ld returned 1 exit status
Makefile:4578: recipe for target 'libmemcached-1.0/t/cc_test' failed
make[1]: *** [libmemcached-1.0/t/cc_test] Error 1
make[1]: *** Waiting for unfinished jobs....
make[1]: Leaving directory '/build/libmemcached/src/libmemcached-1.0.17'
Makefile:3481: recipe for target 'all' failed
make: *** [all] Error 2
==> ERROR: A failure occurred in build().

Steps to reproduce:
sudo extra-x86_64-build
This task depends upon

Closed by  Evangelos Foutras (foutrelis)
Wednesday, 02 July 2014, 14:39 GMT
Reason for closing:  Fixed
Additional comments about closing:  libmemcached 1.0.18-1