Arch Linux

Please read this before reporting a bug:
https://wiki.archlinux.org/index.php/Reporting_Bug_Guidelines

Do NOT report bugs when a package is just outdated, or it is in the AUR. Use the 'flag out of date' link on the package page, or the Mailing List.

REPEAT: Do NOT report bugs for outdated packages!
Tasklist

FS#6892 - digikam needs rebuilding agains new exiv2

Attached to Project: Arch Linux
Opened by Ronald van Haren (pressh) - Thursday, 12 April 2007, 18:12 GMT
Last edited by Tobias Powalowski (tpowa) - Sunday, 15 April 2007, 14:42 GMT
Task Type Bug Report
Category Packages: Current
Status Closed
Assigned To Tobias Powalowski (tpowa)
Architecture All
Severity Low
Priority Normal
Reported Version 0.8 Voodoo
Due in Version Undecided
Due Date Undecided
Percent Complete 100%
Votes 0
Private No

Details

see summary
This task depends upon

Closed by  Tobias Powalowski (tpowa)
Sunday, 15 April 2007, 14:42 GMT
Reason for closing:  Fixed
Comment by Otakar (otula) - Friday, 13 April 2007, 06:20 GMT
I can't compile Digikam with new exiv2
----------------------------------------------
<pre>
iptcwidget.cpp:159: error: request for member 'c_str' in '((Exiv2::Error*)e)->Exiv2::Error::what()', which is of non-class type 'const char*'
iptcwidget.cpp: In member function 'virtual QString Digikam::IptcWidget::getTagTitle(const QString&)':
iptcwidget.cpp:188: error: request for member 'c_str' in '((Exiv2::Error*)e)->Exiv2::Error::what()', which is of non-class type 'const char*'
iptcwidget.cpp: In member function 'virtual QString Digikam::IptcWidget::getTagDescription(const QString&)':
iptcwidget.cpp:205: error: request for member 'c_str' in '((Exiv2::Error*)e)->Exiv2::Error::what()', which is of non-class type 'const char*'
make[5]: *** [iptcwidget.lo] Error 1
make[5]: Leaving directory `/var/abs/extra/multimedia/digikam/src/digikam-0.9.1/digikam/libs/widgets/metadata'
make[4]: *** [all-recursive] Error 1
make[4]: Leaving directory `/var/abs/extra/multimedia/digikam/src/digikam-0.9.1/digikam/libs/widgets'
make[3]: *** [all-recursive] Error 1
make[3]: Leaving directory `/var/abs/extra/multimedia/digikam/src/digikam-0.9.1/digikam/libs'
make[2]: *** [all-recursive] Error 1
make[2]: Leaving directory `/var/abs/extra/multimedia/digikam/src/digikam-0.9.1/digikam'
make[1]: *** [all-recursive] Error 1
make[1]: Leaving directory `/var/abs/extra/multimedia/digikam/src/digikam-0.9.1'
make: *** [all] Error 2
==> ERROR: Build Failed. Aborting...
</pre>
Comment by Ronald van Haren (pressh) - Friday, 13 April 2007, 15:26 GMT
there is a discussion on the digikam mailing list here: http://mail.kde.org/pipermail/digikam-users/2007-March/003251.html

dunno if it will be of any help (don't have time to read it atm :p)

Loading...