Arch Linux

Please read this before reporting a bug:
https://wiki.archlinux.org/index.php/Reporting_Bug_Guidelines

Do NOT report bugs when a package is just outdated, or it is in the AUR. Use the 'flag out of date' link on the package page, or the Mailing List.

REPEAT: Do NOT report bugs for outdated packages!
Tasklist

FS#48714 - [qt5-translations] missing makedepend on qt5-tools

Attached to Project: Arch Linux
Opened by Kevin Mihelich (kmihelich) - Sunday, 27 March 2016, 19:17 GMT
Last edited by Antonio Rojas (arojas) - Sunday, 27 March 2016, 20:56 GMT
Task Type Bug Report
Category Packages: Extra
Status Closed
Assigned To No-one
Architecture All
Severity Low
Priority Normal
Reported Version
Due in Version Undecided
Due Date Undecided
Percent Complete 100%
Votes 0
Private No

Details

Description: Missing makedepend on qt5-tools


Additional info:
* package version: 5.6.0-1
* log:
==> Starting build()...
cd translations/ && ( test -e Makefile || /usr/lib/qt/bin/qmake /build/qt5-translations/src/qttranslations-opensource-src-5.6.0/translations/translations.pro -o Makefile ) && make -f Makefile
make[1]: Entering directory '/build/qt5-translations/src/build/translations'
/usr/lib/qt/bin/lrelease /build/qt5-translations/src/qttranslations-opensource-src-5.6.0/translations/assistant_cs.ts -qm assistant_cs.qm
make[1]: /usr/lib/qt/bin/lrelease: Command not found
/usr/lib/qt/bin/lrelease /build/qt5-translations/src/qttranslations-opensource-src-5.6.0/translations/assistant_da.ts -qm assistant_da.qm
make[1]: /usr/lib/qt/bin/lrelease: Command not found
Makefile:902: recipe for target 'assistant_cs.qm' failed
make[1]: *** [assistant_cs.qm] Error 127
make[1]: *** Waiting for unfinished jobs....
Makefile:905: recipe for target 'assistant_da.qm' failed
make[1]: *** [assistant_da.qm] Error 127
make[1]: Leaving directory '/build/qt5-translations/src/build/translations'
Makefile:42: recipe for target 'sub-translations-make_first' failed
make: *** [sub-translations-make_first] Error 2


Steps to reproduce: Build using a clean chroot.
This task depends upon

Closed by  Antonio Rojas (arojas)
Sunday, 27 March 2016, 20:56 GMT
Reason for closing:  Fixed

Loading...