Arch Linux

Please read this before reporting a bug:
https://wiki.archlinux.org/index.php/Reporting_Bug_Guidelines

Do NOT report bugs when a package is just outdated, or it is in Unsupported. Use the 'flag out of date' link on the package page, or the Mailing List.

REPEAT: Do NOT report bugs for outdated packages!
Tasklist

FS#482 - libusb fails building

Attached to Project: Arch Linux
Opened by Damir Perisa (damir.perisa) - Thursday, 26 February 2004, 17:07 GMT
Task Type Bug Report
Category Packages: Extra
Status Closed
Assigned To arjan timmerman (blaasvis)
Architecture not specified
Severity High
Priority Normal
Reported Version 0.6 Widget
Due in Version Undecided
Due Date Undecided
Percent Complete 0%
Votes 0
Private No

Details

i need /usr/lib/libusb.la to build kdegraphics the right way ... unfortunately it is not in the libusb pkg ... and libusb cannot be rebuilt :-(

here the output:

...
gcc -shared usb.lo error.lo descriptors.lo linux.lo -Wl,-soname -Wl,libusb-0.1.4 -o .libs/libusb-0.1.4.4.0
(cd .libs && rm -f libusb-0.1.4 && ln -s libusb-0.1.4.4.0 libusb-0.1.4)
(cd .libs && rm -f libusb && ln -s libusb-0.1.4.4.0 libusb)
ar cru .libs/libusb.a usb.o error.o descriptors.o linux.o
ranlib .libs/libusb.a
creating libusb.la
(cd .libs && rm -f libusb.la && ln -s ../libusb.la libusb.la)
make[2]: Leaving directory `/home/damir/cvsARCH/extra/lib/libusb/src/libusb-0.1.8'
Making all in tests
make[2]: Entering directory `/home/damir/cvsARCH/extra/lib/libusb/src/libusb-0.1.8/tests'
if gcc -DHAVE_CONFIG_H -I. -I. -I.. -I.. -march=i686 -O2 -pipe -Wall -MT testlibusb.o -MD -MP -MF ".deps/testlibusb.Tpo" \
-c -o testlibusb.o `test -f 'testlibusb.c' || echo './'`testlibusb.c; \
then mv -f ".deps/testlibusb.Tpo" ".deps/testlibusb.Po"; \
else rm -f ".deps/testlibusb.Tpo"; exit 1; \
fi
/bin/sh ../libtool --mode=link gcc -march=i686 -O2 -pipe -Wall -o testlibusb testlibusb.o ../libusb.la
mkdir .libs
gcc -march=i686 -O2 -pipe -Wall -o .libs/testlibusb testlibusb.o ../.libs/libusb
creating testlibusb
make[2]: Leaving directory `/home/damir/cvsARCH/extra/lib/libusb/src/libusb-0.1.8/tests'
Making all in doc
make[2]: Entering directory `/home/damir/cvsARCH/extra/lib/libusb/src/libusb-0.1.8/doc'
rm -rf html
mkdir html
openjade -t sgml -d ./website.dsl\#html ./manual.sgml
openjade: Symbol `_ZTVN6OpenSP9EntityAppE' has different size in shared object, consider re-linking
openjade: Symbol `_ZTVN6OpenSP9ParserAppE' has different size in shared object, consider re-linking
openjade: Symbol `_ZTVN6OpenSP10CmdLineAppE' has different size in shared object, consider re-linking
make[2]: *** [html/index.html] Segmentation fault
make[2]: Leaving directory `/home/damir/cvsARCH/extra/lib/libusb/src/libusb-0.1.8/doc'
make[1]: *** [all-recursive] Error 1
make[1]: Leaving directory `/home/damir/cvsARCH/extra/lib/libusb/src/libusb-0.1.8'
make: *** [all] Error 2
==> ERROR: Build Failed. Aborting...
[damir@Asteraceae libusb]$

without this lib, a lot of usb2-apps will fail working/building
This task depends upon

Closed by  arjan timmerman (blaasvis)
Tuesday, 02 March 2004, 21:16 GMT
Reason for closing:  Fixed
Comment by Damir Perisa (damir.perisa) - Friday, 27 February 2004, 02:32 GMT
openjade segfaults ... need to be repaired?

Loading...