FS#39350 - [lrzsz] build fails

Attached to Project: Community Packages
Opened by Joel Teichroeb (klusark) - Tuesday, 11 March 2014, 15:14 GMT
Last edited by Sergej Pupykin (sergej) - Tuesday, 22 April 2014, 14:48 GMT
Task Type Bug Report
Category Packages
Status Closed
Assigned To Sergej Pupykin (sergej)
Architecture All
Severity Low
Priority Normal
Reported Version
Due in Version Undecided
Due Date Undecided
Percent Complete 100%
Votes 0
Private No

Details

Description:


gcc -DHAVE_CONFIG_H -I. -I. -I.. -D_FORTIFY_SOURCE=2 -march=x86-64 -mtune=generic -O2 -pipe -fstack-protector --param=ssp-buffer-size=4 -c long-options.c
In file included from long-options.c:21:0:
../config.h:61:16: error: duplicate 'unsigned'
#define size_t unsigned
^
../config.h:43:15: error: two or more data types in declaration specifiers
#define off_t long
^
long-options.c: In function 'parse_long_options':
long-options.c:65:4: warning: incompatible implicit declaration of built-in function 'exit' [enabled by default]
exit (0);
^
Makefile:157: recipe for target 'long-options.o' failed
make[2]: *** [long-options.o] Error 1
make[2]: Leaving directory '/build/lrzsz/src/lrzsz-0.12.20/lib'
Makefile:172: recipe for target 'all-recursive' failed
make[1]: *** [all-recursive] Error 1
make[1]: Leaving directory '/build/lrzsz/src/lrzsz-0.12.20'
Makefile:282: recipe for target 'all-recursive-am' failed
make: *** [all-recursive-am] Error 2
==> ERROR: A failure occurred in build().
Aborting...

Steps to reproduce:
sudo extra-x86_64-build
This task depends upon

Closed by  Sergej Pupykin (sergej)
Tuesday, 22 April 2014, 14:48 GMT
Reason for closing:  Fixed

Loading...