Arch Linux

Please read this before reporting a bug:

Do NOT report bugs when a package is just outdated, or it is in Unsupported. Use the 'flag out of date' link on the package page, or the Mailing List.

REPEAT: Do NOT report bugs for outdated packages!

FS#27377 - [physfs] doesn't build

Attached to Project: Arch Linux
Opened by Andrea Scarpino (BaSh) - Thursday, 01 December 2011, 07:54 GMT
Last edited by Eric Belanger (Snowman) - Thursday, 01 December 2011, 11:18 GMT
Task Type Bug Report
Category Packages: Extra
Status Closed
Assigned To Eric Belanger (Snowman)
Architecture All
Severity Low
Priority Normal
Reported Version
Due in Version Undecided
Due Date Undecided
Percent Complete 100%
Votes 0
Private No


[ 28%] Building C object CMakeFiles/physfs.dir/archivers/wad.o
/build/src/physfs-2.0.2/archivers/wad.c: In function 'wad_load_entries':
/build/src/physfs-2.0.2/archivers/wad.c:248:10: error: variable 'lastDirectory' set but not used [-Werror=unused-but-set-variable]
cc1: all warnings being treated as errors

make[2]: *** [CMakeFiles/physfs.dir/archivers/wad.o] Error 1
make[1]: *** [CMakeFiles/physfs.dir/all] Error 2
make: *** [all] Error 2

Additional info:
* physfs 2.0.2-1

Steps to reproduce:
Try to build it.
This task depends upon

Closed by  Eric Belanger (Snowman)
Thursday, 01 December 2011, 11:18 GMT
Reason for closing:  Fixed
Additional comments about closing:  physfs-2.0.2-2