Community Packages

Please read this before reporting a bug:
https://wiki.archlinux.org/title/Bug_reporting_guidelines

Do NOT report bugs when a package is just outdated, or it is in the AUR. Use the 'flag out of date' link on the package page, or the Mailing List.

REPEAT: Do NOT report bugs for outdated packages!
Tasklist

FS#27037 - [kdesvn] doesn't build

Attached to Project: Community Packages
Opened by Andrea Scarpino (BaSh) - Friday, 18 November 2011, 13:50 GMT
Last edited by Giovanni Scafora (giovanni) - Wednesday, 29 February 2012, 22:56 GMT
Task Type Bug Report
Category Packages
Status Closed
Assigned To Jaroslav Lichtblau (Dragonlord)
Architecture All
Severity Low
Priority Normal
Reported Version
Due in Version Undecided
Due Date Undecided
Percent Complete 100%
Votes 0
Private No

Details

Description:
index.docbook:1721: element keycombo: validity error : No declaration for element keycombo
<shortcut><keycombo action="simul">&Ctrl;<keycap>u</keycap></keycombo></shortcut
^
index.docbook:1721: element shortcut: validity error : No declaration for element shortcut
<shortcut><keycombo action="simul">&Ctrl;<keycap>u</keycap></keycombo></shortcut
^
index.docbook:1722: element guimenu: validity error : No declaration for element guimenu
<guimenu>Subversion</guimenu>
^
index.docbook:1723: element guisubmenu: validity error : No declaration for element guisubmenu
<guisubmenu>Werkkopie</guisubmenu>
^
index.docbook:1724: element guimenuitem: validity error : No declaration for element guimenuitem
<guimenuitem>Bijwerken naar HEAD</guimenuitem>
^
index.docbook:1725: element menuchoice: validity error : No declaration for element menuchoice
</menuchoice></term>
^
index.docbook:1725: element term: validity error : No declaration for element term
</menuchoice></term>
^
index.docbook:1726: element para: validity error : No declaration for element para
<listitem><para>De werkkopie bijwerken naar de HEAD van de repository.</para></l
^
index.docbook:1726: element listitem: validity error : No declaration for element listitem
em><para>De werkkopie bijwerken naar de HEAD van de repository.</para></listitem
^
index.docbook:1727: element varlistentry: validity error : No declaration for element varlistentry
</varlistentry>
^
index.docbook:1730: element guimenu: validity error : No declaration for element guimenu
<guimenu>Subversion</guimenu>
^
index.docbook:1731: element guisubmenu: validity error : No declaration for element guisubmenu
<guisubmenu>Werkkopie</guisubmenu>
^
index.docbook:1732: element guimenuitem: validity error : No declaration for element guimenuitem
<guimenuitem>Bijwerken naar revisie...</guimenuitem>
^
index.docbook:1733: element menuchoice: validity error : No declaration for element menuchoice
</menuchoice></term>
^
index.docbook:1733: element term: validity error : No declaration for element term
</menuchoice></term>
^
index.docbook:1734: element para: validity error : No declaration for element para
<para>De werkkopie bijwerken naar een bepaalde revisie van de repository.</para>
^
index.docbook:1734: element listitem: validity error : No declaration for element listitem
erkkopie bijwerken naar een bepaalde revisie van de repository.</para></listitem
^
index.docbook:1735: element varlistentry: validity error : No declaration for element varlistentry
</varlistentry>
^
index.docbook:1738: element keycombo: validity error : No declaration for attribute action of element keycombo
<shortcut><keycombo action="simul"><keycap>#</keycap></keycombo></shortcut>
^
index.docbook:1738: element keycap: validity error : No declaration for element keycap
<shortcut><keycombo action="simul"><keycap>#</keycap></keycombo></shortcut>
^
index.docbook:1738: element keycombo: validity error : No declaration for element keycombo
<shortcut><keycombo action="simul"><keycap>#</keycap></keycombo></shortcut>
^
index.docbook:1738: element shortcut: validity error : No declaration for element shortcut
<shortcut><keycombo action="simul"><keycap>#</keycap></keycombo></shortcut>
^
index.docbook:1739: element guimenu: validity error : No declaration for element guimenu
<guimenu>Subversion</guimenu>
^
index.docbook:1740: element guisubmenu: validity error : No declaration for element guisubmenu
<guisubmenu>Werkkopie</guisubmenu>
^
index.docbook:1741: element guimenuitem: validity error : No declaration for element guimenuitem
<guimenuitem>Vastleggen</guimenuitem>
^
index.docbook:1742: element menuchoice: validity error : No declaration for element menuchoice
</menuchoice></term>
^
index.docbook:1742: element term: validity error : No declaration for element term
</menuchoice></term>
^
index.docbook:1743: element para: validity error : No declaration for element para
an de gemarkeerde items in de werkkopie vast (commit) naar de repository.</para>
^
index.docbook:1743: element listitem: validity error : No declaration for element listitem
rkeerde items in de werkkopie vast (commit) naar de repository.</para></listitem
^
index.docbook:1744: element varlistentry: validity error : No declaration for element varlistentry
</varlistentry>
^
index.docbook:1747: element keycombo: validity error : No declaration for attribute action of element keycombo
<shortcut><keycombo action="simul">&Ctrl;<keycap>D</keycap></keycombo></shortcut
^
index.docbook:1747: parser error : Entity 'Ctrl' not defined
<shortcut><keycombo action="simul">&Ctrl;<keycap>D</keycap></keycombo></shortcut
^
index.docbook:1747: element keycap: validity error : No declaration for element keycap
<shortcut><keycombo action="simul">&Ctrl;<keycap>D</keycap></keycombo></shortcut
^
index.docbook:1747: element keycombo: validity error : No declaration for element keycombo
<shortcut><keycombo action="simul">&Ctrl;<keycap>D</keycap></keycombo></shortcut
^
index.docbook:1747: element shortcut: validity error : No declaration for element shortcut
<shortcut><keycombo action="simul">&Ctrl;<keycap>D</keycap></keycombo></shortcut
^
index.docbook:1748: element guimenu: validity error : No declaration for element guimenu
<guimenu>Subversion</guimenu>
^
index.docbook:1749: element guisubmenu: validity error : No declaration for element guisubmenu
<guisubmenu>Werkkopie</guisubmenu>
^
index.docbook:1750: element guimenuitem: validity error : No declaration for element guimenuitem
<guimenuitem>Verschil bepalen lokale wijzigingen</guimenuitem>
^
index.docbook:1751: element menuchoice: validity error : No declaration for element menuchoice
</menuchoice></term>
^
index.docbook:1751: element term: validity error : No declaration for element term
</menuchoice></term>
^
index.docbook:1752: element para: validity error : No declaration for element para
ijgewerkte stand van de werkkopie, niet tegen de versie in de repository.</para>
^
index.docbook:1752: element listitem: validity error : No declaration for element listitem
stand van de werkkopie, niet tegen de versie in de repository.</para></listitem
^
index.docbook:1753: element varlistentry: validity error : No declaration for element varlistentry
</varlistentry>
^
index.docbook:1756: element keycombo: validity error : No declaration for attribute action of element keycombo
<shortcut><keycombo action="simul">&Ctrl;<keycap>H</keycap></keycombo></shortcut
^
index.docbook:1756: parser error : Entity 'Ctrl' not defined
<shortcut><keycombo action="simul">&Ctrl;<keycap>H</keycap></keycombo></shortcut
^
index.docbook:1756: element keycap: validity error : No declaration for element keycap
<shortcut><keycombo action="simul">&Ctrl;<keycap>H</keycap></keycombo></shortcut
^
index.docbook:1756: element keycombo: validity error : No declaration for element keycombo
<shortcut><keycombo action="simul">&Ctrl;<keycap>H</keycap></keycombo></shortcut
^
index.docbook:1756: element shortcut: validity error : No declaration for element shortcut
<shortcut><keycombo action="simul">&Ctrl;<keycap>H</keycap></keycombo></shortcut
^
index.docbook:1757: element guimenu: validity error : No declaration for element guimenu
<guimenu>Subversion</guimenu>
^
index.docbook:1758: element guisubmenu: validity error : No declaration for element guisubmenu
<guisubmenu>Werkkopie</guisubmenu>
^
index.docbook:1759: element guimenuitem: validity error : No declaration for element guimenuitem
<guimenuitem>Verschil bepalen ten opzichte van HEAD</guimenuitem>
^
index.docbook:1760: element menuchoice: validity error : No declaration for element menuchoice
</menuchoice></term>
^
index.docbook:1760: element term: validity error : No declaration for element term
</menuchoice></term>
^
index.docbook:1761: element para: validity error : No declaration for element para
<listitem><para>Diff's de huidige werkkopie tegen HEAD van de repository.</para>
^
index.docbook:1761: element listitem: validity error : No declaration for element listitem
<para>Diff's de huidige werkkopie tegen HEAD van de repository.</para></listitem
^
index.docbook:1762: element varlistentry: validity error : No declaration for element varlistentry
</varlistentry>
^
index.docbook:1765: element keycombo: validity error : No declaration for attribute action of element keycombo
<shortcut><keycombo action="simul"><keycap>P</keycap></keycombo></shortcut>
^
index.docbook:1765: element keycap: validity error : No declaration for element keycap
<shortcut><keycombo action="simul"><keycap>P</keycap></keycombo></shortcut>
^
index.docbook:1765: element keycombo: validity error : No declaration for element keycombo
<shortcut><keycombo action="simul"><keycap>P</keycap></keycombo></shortcut>
^
index.docbook:1765: element shortcut: validity error : No declaration for element shortcut
<shortcut><keycombo action="simul"><keycap>P</keycap></keycombo></shortcut>
^
index.docbook:1766: element guimenu: validity error : No declaration for element guimenu
<guimenu>Subversion</guimenu>
^
index.docbook:1767: element guisubmenu: validity error : No declaration for element guisubmenu
<guisubmenu>Werkkopie</guisubmenu>
^
index.docbook:1768: element guimenuitem: validity error : No declaration for element guimenuitem
<guimenuitem>Eigenschappen</guimenuitem>
^
index.docbook:1769: element menuchoice: validity error : No declaration for element menuchoice
</menuchoice></term>
^
index.docbook:1769: element term: validity error : No declaration for element term
</menuchoice></term>
^
index.docbook:1770: element para: validity error : No declaration for element para
<listitem><para>Tonen/Bewerken van eigenschappen van het huidige item.</para></l
^
index.docbook:1770: element listitem: validity error : No declaration for element listitem
em><para>Tonen/Bewerken van eigenschappen van het huidige item.</para></listitem
^
index.docbook:1771: element varlistentry: validity error : No declaration for element varlistentry
</varlistentry>
^
index.docbook:1774: element keycombo: validity error : No declaration for attribute action of element keycombo
<shortcut><keycombo action="simul"><keycap>Insert</keycap></keycombo></shortcut>
^
index.docbook:1774: element keycap: validity error : No declaration for element keycap
<shortcut><keycombo action="simul"><keycap>Insert</keycap></keycombo></shortcut>
^
index.docbook:1774: element keycombo: validity error : No declaration for element keycombo
<shortcut><keycombo action="simul"><keycap>Insert</keycap></keycombo></shortcut>
^
index.docbook:1774: element shortcut: validity error : No declaration for element shortcut
<shortcut><keycombo action="simul"><keycap>Insert</keycap></keycombo></shortcut>
^
index.docbook:1775: element guimenu: validity error : No declaration for element guimenu
<guimenu>Subversion</guimenu>
^
index.docbook:1776: element guisubmenu: validity error : No declaration for element guisubmenu
<guisubmenu>Werkkopie</guisubmenu>
^
index.docbook:1777: element guimenuitem: validity error : No declaration for element guimenuitem
<guimenuitem>Gemarkeerde bestanden/mappen toevoegen</guimenuitem>
^
index.docbook:1778: element menuchoice: validity error : No declaration for element menuchoice
</menuchoice></term>
^
index.docbook:1778: element term: validity error : No declaration for element term
</menuchoice></term>
^
index.docbook:1779: element para: validity error : No declaration for element para
a>Leg de gemarkeerde bestanden/mappen vast (commit) aan revisie controle.</para>
^
index.docbook:1779: element listitem: validity error : No declaration for element listitem
emarkeerde bestanden/mappen vast (commit) aan revisie controle.</para></listitem
^
index.docbook:1780: element varlistentry: validity error : No declaration for element varlistentry
</varlistentry>
^
index.docbook:1783: element guimenu: validity error : No declaration for element guimenu
<guimenu>Subversion</guimenu>
^
index.docbook:1784: element guisubmenu: validity error : No declaration for element guisubmenu
<guisubmenu>Werkkopie</guisubmenu>
^
index.docbook:1785: element guimenuitem: validity error : No declaration for element guimenuitem
<guimenuitem>Huidige veranderingen terugdraaien</guimenuitem>
^
index.docbook:1786: element menuchoice: validity error : No declaration for element menuchoice
</menuchoice></term>
^
index.docbook:1786: element term: validity error : No declaration for element term
</menuchoice></term>
^
index.docbook:1787: element para: validity error : No declaration for element para
anderingen in de werkkopie ongedaan naar de laatste bijgewerkte toestand.</para>
^
index.docbook:1787: element listitem: validity error : No declaration for element listitem
in de werkkopie ongedaan naar de laatste bijgewerkte toestand.</para></listitem
^
index.docbook:1788: element varlistentry: validity error : No declaration for element varlistentry
</varlistentry>
^
index.docbook:1791: element guimenu: validity error : No declaration for element guimenu
<guimenu>Subversion</guimenu>
^
index.docbook:1792: element guisubmenu: validity error : No declaration for element guisubmenu
<guisubmenu>Werkkopie</guisubmenu>
^
index.docbook:1793: element guimenuitem: validity error : No declaration for element guimenuitem
<guimenuitem>Recursief oplossen</guimenuitem>
^
index.docbook:1794: element menuchoice: validity error : No declaration for element menuchoice
</menuchoice></term>
^
index.docbook:1794: element term: validity error : No declaration for element term
</menuchoice></term>
^
index.docbook:1795: element para: validity error : No declaration for element para
de items als "niet in conflict" en verwijder de daarbijhorende bestanden.</para>
^
index.docbook:1795: element listitem: validity error : No declaration for element listitem
ls "niet in conflict" en verwijder de daarbijhorende bestanden.</para></listitem
^
index.docbook:1796: element varlistentry: validity error : No declaration for element varlistentry
</varlistentry>
^
index.docbook:1799: element guimenu: validity error : No declaration for element guimenu
<guimenu>Subversion</guimenu>
^
index.docbook:1800: element guisubmenu: validity error : No declaration for element guisubmenu
<guisubmenu>Werkkopie</guisubmenu>
^
index.docbook:1801: element guimenuitem: validity error : No declaration for element guimenuitem
<guimenuitem>Twee revisies samenvoegen</guimenuitem>
^
index.docbook:1802: element menuchoice: validity error : No declaration for element menuchoice
</menuchoice></term>
^
index.docbook:1802: element term: validity error : No declaration for element term
</menuchoice></term>
^
index.docbook:1803: element para: validity error : No declaration for element para
item><para>Voeg twee revisies van een item samen (merge )in de werkkopie.</para>
^
index.docbook:1803: element listitem: validity error : No declaration for element listitem
>Voeg twee revisies van een item samen (merge )in de werkkopie.</para></listitem
^
index.docbook:1804: element varlistentry: validity error : No declaration for element varlistentry
</varlistentry>
^
index.docbook:1807: element guimenu: validity error : No declaration for element guimenu
<guimenu>Subversion</guimenu>
^
index.docbook:1808: element guisubmenu: validity error : No declaration for element guisubmenu
<guisubmenu>Werkkopie</guisubmenu>
^
index.docbook:1809: element guimenuitem: validity error : No declaration for element guimenuitem
<guimenuitem>Huidige item negeren/negeren opheffen</guimenuitem>
^
index.docbook:1810: element menuchoice: validity error : No declaration for element menuchoice
</menuchoice></term>
^
index.docbook:1810: element term: validity error : No declaration for element term
</menuchoice></term>
^
index.docbook:1811: element para: validity error : No declaration for element para
m gemarkeerd wordt als negeren of juist weer van de negeer-lijst afhalen.</para>
^
index.docbook:1811: element listitem: validity error : No declaration for element listitem
rd wordt als negeren of juist weer van de negeer-lijst afhalen.</para></listitem
^
index.docbook:1812: element varlistentry: validity error : No declaration for element varlistentry
</varlistentry>
^
index.docbook:1815: element guimenu: validity error : No declaration for element guimenu
<guimenu>Subversion</guimenu>
^
index.docbook:1816: element guisubmenu: validity error : No declaration for element guisubmenu
<guisubmenu>Werkkopie</guisubmenu>
^
index.docbook:1817: element guimenuitem: validity error : No declaration for element guimenuitem
<guimenuitem>Opruimen</guimenuitem>
^
index.docbook:1818: element menuchoice: validity error : No declaration for element menuchoice
</menuchoice></term>
^
index.docbook:1818: element term: validity error : No declaration for element term
</menuchoice></term>
^
index.docbook:1819: element para: validity error : No declaration for element para
de werkkopie op en verwijder de aanwezig zijnde (commit-)vergrendelingen.</para>
^
index.docbook:1819: element listitem: validity error : No declaration for element listitem
ie op en verwijder de aanwezig zijnde (commit-)vergrendelingen.</para></listitem
^
index.docbook:1820: element varlistentry: validity error : No declaration for element varlistentry
</varlistentry>
^
index.docbook:1823: element guimenu: validity error : No declaration for element guimenu
<guimenu>Subversion</guimenu>
^
index.docbook:1824: element guisubmenu: validity error : No declaration for element guisubmenu
<guisubmenu>Werkkopie</guisubmenu>
^
index.docbook:1825: element guimenuitem: validity error : No declaration for element guimenuitem
<guimenuitem>Repository switchen</guimenuitem>
^
index.docbook:1826: element menuchoice: validity error : No declaration for element menuchoice
</menuchoice></term>
^
index.docbook:1826: element term: validity error : No declaration for element term
</menuchoice></term>
^
index.docbook:1827: element para: validity error : No declaration for element para
werkkopie. &quot;relocate&quot; Dit wordt op dit moment niet ondersteund.</para>
^
index.docbook:1827: element listitem: validity error : No declaration for element listitem
&quot;relocate&quot; Dit wordt op dit moment niet ondersteund.</para></listitem
^
index.docbook:1828: element varlistentry: validity error : No declaration for element varlistentry
</varlistentry>
^
index.docbook:1831: element guimenu: validity error : No declaration for element guimenu
<guimenu>Subversion</guimenu>
^
index.docbook:1832: element guisubmenu: validity error : No declaration for element guisubmenu
<guisubmenu>Werkkopie</guisubmenu>
^
index.docbook:1833: element guimenuitem: validity error : No declaration for element guimenuitem
<guimenuitem>Repository switchen</guimenuitem>
^
index.docbook:1834: element menuchoice: validity error : No declaration for element menuchoice
</menuchoice></term>
^
index.docbook:1834: element term: validity error : No declaration for element term
</menuchoice></term>
^
index.docbook:1835: element para: validity error : No declaration for element para
<listitem><para>Opent de repositoryboom van een andere werkkopie.</para></listit
^
index.docbook:1835: element listitem: validity error : No declaration for element listitem
istitem><para>Opent de repositoryboom van een andere werkkopie.</para></listitem
^
index.docbook:1836: element varlistentry: validity error : No declaration for element varlistentry
</varlistentry>
^
index.docbook:1837: element variablelist: validity error : No declaration for element variablelist
</variablelist>
^
index.docbook:1838: element sect3: validity error : No declaration for element sect3
</sect3>
^
index.docbook:1840: element title: validity error : No declaration for element title
<title>Repository</title>
^
index.docbook:1844: element guimenu: validity error : No declaration for element guimenu
<guimenu>Subversion</guimenu>
^
index.docbook:1845: element guisubmenu: validity error : No declaration for element guisubmenu
<guisubmenu>Repository</guisubmenu>
^
index.docbook:1846: element guimenuitem: validity error : No declaration for element guimenuitem
<guimenuitem>Huidige repositorypad uitchecken</guimenuitem>
^
index.docbook:1847: element menuchoice: validity error : No declaration for element menuchoice
</menuchoice></term>
^
index.docbook:1847: element term: validity error : No declaration for element term
</menuchoice></term>
^
index.docbook:1848: element para: validity error : No declaration for element para
Maakt een werkkopie van de huidige geselecteerde item als het een map is.</para>
^
index.docbook:1848: element listitem: validity error : No declaration for element listitem
werkkopie van de huidige geselecteerde item als het een map is.</para></listitem
^
index.docbook:1849: element varlistentry: validity error : No declaration for element varlistentry
</varlistentry>
^
index.docbook:1852: element guimenu: validity error : No declaration for element guimenu
<guimenu>Subversion</guimenu>
^
index.docbook:1853: element guisubmenu: validity error : No declaration for element guisubmenu
<guisubmenu>Repository</guisubmenu>
^
index.docbook:1854: element guimenuitem: validity error : No declaration for element guimenuitem
<guimenuitem>Huidige repositorypad exporteren</guimenuitem>
^
index.docbook:1855: element menuchoice: validity error : No declaration for element menuchoice
</menuchoice></term>
^
index.docbook:1855: element term: validity error : No declaration for element term
</menuchoice></term>
^
index.docbook:1856: element para: validity error : No declaration for element para
p het lokale bestandsysteem van de geselecteerde item als het een map is.</para>
^
index.docbook:1856: element listitem: validity error : No declaration for element listitem
le bestandsysteem van de geselecteerde item als het een map is.</para></listitem
^
index.docbook:1857: element varlistentry: validity error : No declaration for element varlistentry
</varlistentry>
^
index.docbook:1858: element variablelist: validity error : No declaration for element variablelist
</variablelist>
^
index.docbook:1859: element sect3: validity error : No declaration for element sect3
</sect3>
^
index.docbook:1860: element sect2: validity error : No declaration for element sect2
</sect2>
^
index.docbook:1862: element guimenu: validity error : No declaration for element guimenu
<title>Het <guimenu>Help</guimenu> Menu</title>
^
index.docbook:1862: element title: validity error : No declaration for element title
<title>Het <guimenu>Help</guimenu> Menu</title>
^
index.docbook:1869: parser error : Entity 'help.menu.documentation' not defined
&help.menu.documentation;
^
index.docbook:1871: element sect2: validity error : No declaration for element sect2
</sect2>
^
index.docbook:1873: element sect2: validity error : No declaration for attribute id of element sect2
<sect2 id="kdesvn-svntoolbar">
^
index.docbook:1874: element title: validity error : No declaration for element title
<title>De subversion werkbalk</title>
^
index.docbook:1878: element guibutton: validity error : No declaration for element guibutton
<guibutton>Openen</guibutton>
^
index.docbook:1879: element term: validity error : No declaration for element term
</term>
^
index.docbook:1880: element para: validity error : No declaration for element para
<listitem><para>Open een werkkopie</para></listitem>
^
index.docbook:1880: element listitem: validity error : No declaration for element listitem
<listitem><para>Open een werkkopie</para></listitem>
^
index.docbook:1881: element varlistentry: validity error : No declaration for element varlistentry
</varlistentry>
^
index.docbook:1882: element variablelist: validity error : No declaration for element variablelist
</variablelist>
^
index.docbook:1883: element sect2: validity error : No declaration for element sect2
</sect2>
^
index.docbook:1885: element sect1: validity error : No declaration for element sect1
</sect1>
^
index.docbook:1886: element chapter: validity error : No declaration for element chapter
</chapter>
^
index.docbook:1888: element chapter: validity error : No declaration for attribute id of element chapter
<chapter id="faq">
^
index.docbook:1889: element title: validity error : No declaration for element title
<title>Vraag en antwoord</title>
^
index.docbook:1906: element qandaset: validity error : No declaration for attribute id of element qandaset
<qandaset id="faqlist">
^
index.docbook:1909: element para: validity error : No declaration for element para
bruikt wordt, wordt telkens opnieuw naar het wachtwoord gevraagt, waarom ?</para
^
index.docbook:1910: element question: validity error : No declaration for element question
</question>
^
index.docbook:1914: element para: validity error : No declaration for element para
</para>
^
index.docbook:1916: element ulink: validity error : No declaration for attribute url of element ulink
agt daarom steeds opnieuw naar Uw wachtwoord. (Lees ook <ulink url="man:ssh-add"
^
index.docbook:1916: element ulink: validity error : No declaration for element ulink
ar Uw wachtwoord. (Lees ook <ulink url="man:ssh-add">Manpage van ssh-add</ulink>
^
index.docbook:1917: element para: validity error : No declaration for element para
</para>
^
index.docbook:1919: element ulink: validity error : No declaration for attribute url of element ulink
<ulink url="http://steamedpenguin.com/kdesvn-and-private-keys/">Steamedpenguin h
^
index.docbook:1919: element ulink: validity error : No declaration for element ulink
om/kdesvn-and-private-keys/">Steamedpenguin heeft een mooie beschrijving</ulink>
^
index.docbook:1920: element para: validity error : No declaration for element para
</para>
^
index.docbook:1921: element answer: validity error : No declaration for element answer
</answer>
^
index.docbook:1922: element qandaentry: validity error : No declaration for element qandaentry
</qandaentry>
^
index.docbook:1925: element para: validity error : No declaration for element para
&kappname; vanuit de terminal wordt gestart, hoe kan ik dit uitschakelen?</para
^
index.docbook:1926: element question: validity error : No declaration for element question
</question>
^
index.docbook:1929: element ulink: validity error : No declaration for attribute url of element ulink
en niet in een X-dialoog zoals kdesvnaskpass. (Lees ook <ulink url="man:ssh-add"
^
index.docbook:1929: element ulink: validity error : No declaration for element ulink
ls kdesvnaskpass. (Lees ook <ulink url="man:ssh-add">Manpage van ssh-add</ulink>
^
index.docbook:1930: element para: validity error : No declaration for element para
</para>
^
index.docbook:1931: element answer: validity error : No declaration for element answer
</answer>
^
index.docbook:1932: element qandaentry: validity error : No declaration for element qandaentry
</qandaentry>
^
index.docbook:1935: element para: validity error : No declaration for element para
es, toont &kappname; iets niet terwijl ik weet dat er nieuwere items zijn!</para
^
index.docbook:1936: element question: validity error : No declaration for element question
</question>
^
index.docbook:1940: element para: validity error : No declaration for element para
</para>
^
index.docbook:1941: element answer: validity error : No declaration for element answer
</answer>
^
index.docbook:1942: element qandaentry: validity error : No declaration for element qandaentry
</qandaentry>
^
index.docbook:1945: element para: validity error : No declaration for element para
n de KPart niet vinden&quot; en toont vervolgens een leeg venster, waarom?</para
^
index.docbook:1946: element question: validity error : No declaration for element question
</question>
^
index.docbook:1950: element ulink: validity error : No declaration for attribute url of element ulink
val de beschrijving van de <ulink url="http://kdesvn.alwins-world.de/ticket/128"
^
index.docbook:1950: element ulink: validity error : No declaration for element ulink
van de <ulink url="http://kdesvn.alwins-world.de/ticket/128">issue entry</ulink>
^
index.docbook:1951: element para: validity error : No declaration for element para
</para>
^
index.docbook:1953: element prompt: validity error : No declaration for element prompt
egeven. De onderdelen worden dan geïnstalleerd in <prompt>$PREFIX/lib</prompt>
^
index.docbook:1953: element prompt: validity error : No declaration for element prompt
erd in <prompt>$PREFIX/lib</prompt> inplaats van <prompt>$PREFIX/lib64</prompt>
^
index.docbook:1953: element prompt: validity error : No declaration for element prompt
van <prompt>$PREFIX/lib64</prompt>. Geef daarom <prompt>-DLIB_SUFFIX=64</prompt>
^
index.docbook:1954: element para: validity error : No declaration for element para
</para>
^
index.docbook:1960: element programlisting: validity error : No declaration for element programlisting
</programlisting>
^
index.docbook:1962: element para: validity error : No declaration for element para
</para>
^
index.docbook:1965: element para: validity error : No declaration for element para
</para>
^
index.docbook:1966: element answer: validity error : No declaration for element answer
</answer>
^
index.docbook:1967: element qandaentry: validity error : No declaration for element qandaentry
</qandaentry>
^
index.docbook:1968: element qandaset: validity error : No declaration for element qandaset
</qandaset>
^
index.docbook:1969: element chapter: validity error : No declaration for element chapter
</chapter>
^
index.docbook:1971: element appendix: validity error : No declaration for attribute id of element appendix
<appendix id="revision-syntax">
^
index.docbook:1972: element title: validity error : No declaration for element title
<title>Opbouw voor revisies</title>
^
index.docbook:1975: element para: validity error : No declaration for element para
</para>
^
index.docbook:1980: element term: validity error : No declaration for element term
<term>Nummers</term>
^
index.docbook:1983: element para: validity error : No declaration for element para
</para></listitem>
^
index.docbook:1983: element listitem: validity error : No declaration for element listitem
</para></listitem>
^
index.docbook:1984: element varlistentry: validity error : No declaration for element varlistentry
</varlistentry>
^
index.docbook:1987: element term: validity error : No declaration for element term
<term>Trefwoord</term>
^
index.docbook:1994: element para: validity error : No declaration for element para
</para></listitem>
^
index.docbook:1994: element listitem: validity error : No declaration for element listitem
</para></listitem>
^
index.docbook:1998: element para: validity error : No declaration for element para
</para></listitem>
^
index.docbook:1998: element listitem: validity error : No declaration for element listitem
</para></listitem>
^
index.docbook:2002: element para: validity error : No declaration for element para
</para></listitem>
^
index.docbook:2002: element listitem: validity error : No declaration for element listitem
</para></listitem>
^
index.docbook:2006: element para: validity error : No declaration for element para
</para></listitem>
^
index.docbook:2006: element listitem: validity error : No declaration for element listitem
</para></listitem>
^
index.docbook:2010: element para: validity error : No declaration for element para
</para></listitem>
^
index.docbook:2010: element listitem: validity error : No declaration for element listitem
</para></listitem>
^
index.docbook:2014: element para: validity error : No declaration for element para
</para></listitem>
^
index.docbook:2014: element listitem: validity error : No declaration for element listitem
</para></listitem>
^
index.docbook:2016: element itemizedlist: validity error : No declaration for element itemizedlist
</itemizedlist>
^
index.docbook:2018: element para: validity error : No declaration for element para
</para>
^
index.docbook:2021: element para: validity error : No declaration for element para
</para>
^
index.docbook:2022: element listitem: validity error : No declaration for element listitem
</listitem>
^
index.docbook:2023: element varlistentry: validity error : No declaration for element varlistentry
</varlistentry>
^
index.docbook:2026: element term: validity error : No declaration for element term
<term>Datum</term>
^
index.docbook:2029: element para: validity error : No declaration for element para
</para></listitem>
^
index.docbook:2029: element listitem: validity error : No declaration for element listitem
</para></listitem>
^
index.docbook:2030: element varlistentry: validity error : No declaration for element varlistentry
</varlistentry>
^
index.docbook:2032: element variablelist: validity error : No declaration for element variablelist
</variablelist>
^
index.docbook:2034: element para: validity error : No declaration for element para
</para>
^
index.docbook:2037: element para: validity error : No declaration for element para
</para>
^
index.docbook:2038: element appendix: validity error : No declaration for element appendix
</appendix>
^
index.docbook:2040: element appendix: validity error : No declaration for attribute id of element appendix
<appendix id="further">
^
index.docbook:2041: element title: validity error : No declaration for element title
<title>Meer informatie</title>
^
index.docbook:2043: element title: validity error : No declaration for element title
<title>Bugs melden / terugkoppeling</title>
^
index.docbook:2045: element email: validity error : No declaration for element email
et Engels)kunnen gezonden worden naar <email>kdesvn-bugs@alwins-world.de</email>
^
index.docbook:2045: element email: validity error : No declaration for element email
et gebruik of andere terugkoppelingen naar <email>kdesvn@alwins-world.de</email>
^
index.docbook:2046: element para: validity error : No declaration for element para
</para>
^
index.docbook:2048: element ulink: validity error : No declaration for attribute url of element ulink
zijn te verkrijgen op <ulink url="http://lists.alwins-world.de/mailman/listinfo"
^
index.docbook:2048: element ulink: validity error : No declaration for element ulink
"http://lists.alwins-world.de/mailman/listinfo">mailinglijsten overzicht</ulink>
^
index.docbook:2049: element para: validity error : No declaration for element para
</para>
^
index.docbook:2050: element sect1: validity error : No declaration for element sect1
</sect1>
^
index.docbook:2051: element sect1: validity error : No declaration for attribute id of element sect1
<sect1 id="credits-and-license">
^
index.docbook:2056: element title: validity error : No declaration for element title
<title>Dankbetuigingen en licenties</title>
^
index.docbook:2058: element email: validity error : No declaration for element email
rogramma copyright 2005-2006 Rajko Albrecht <email>kdesvn@alwins-world.de</email
^
index.docbook:2059: element para: validity error : No declaration for element para
</para>
^
index.docbook:2063: element email: validity error : No declaration for element email
<listitem><para>Andreas Richter <email>ar@oszine.de</email> - voor de overzettin
^
index.docbook:2063: element para: validity error : No declaration for element para
chter <email>ar@oszine.de</email> - voor de overzetting naar qt4 van svnqt</para
^
index.docbook:2064: element listitem: validity error : No declaration for element listitem
</listitem>
^
index.docbook:2065: element email: validity error : No declaration for element email
<listitem><para>Michael Biebl <email>biebl@teco.edu</email> - voor de vele hulp,
^
index.docbook:2065: element para: validity error : No declaration for element para
email>biebl@teco.edu</email> - voor de vele hulp, idee├źn en aanwijzingen.</para
^
index.docbook:2066: element listitem: validity error : No declaration for element listitem
</listitem>
^
index.docbook:2067: element email: validity error : No declaration for element email
<listitem><para>Bram Schoenmakers <email>bramschoenmakers@kde.nl</email> - voor
^
index.docbook:2067: element para: validity error : No declaration for element para
anwijzingen, Nederlandse vertaling van de menu's, opschonen van mijn code.</para
^
index.docbook:2068: element listitem: validity error : No declaration for element listitem
</listitem>
^
index.docbook:2069: element email: validity error : No declaration for element email
<listitem><para>Ronald Stroethoff <email>stroet43@zonnet.nl</email> - voor de Ne
^
index.docbook:2069: element para: validity error : No declaration for element para
@zonnet.nl</email> - voor de Nederlandse vertaling van deze help-pagina's.</para
^
index.docbook:2070: element listitem: validity error : No declaration for element listitem
</listitem>
^
index.docbook:2071: element itemizedlist: validity error : No declaration for element itemizedlist
</itemizedlist>
^
index.docbook:2073: element para: validity error : No declaration for element para
</para>
^
index.docbook:2075: element ulink: validity error : No declaration for attribute url of element ulink
epage van &kappname; of vraag op <ulink url="mailto:kdesvn-i10n@alwins-world.de"
^
index.docbook:2075: element email: validity error : No declaration for element email
="mailto:kdesvn-i10n@alwins-world.de"><email>kdesvn-i10n@alwins-world.de</email>
^
index.docbook:2075: element ulink: validity error : No declaration for element ulink
@alwins-world.de"><email>kdesvn-i10n@alwins-world.de</email> mailinglist</ulink>
^
index.docbook:2076: element para: validity error : No declaration for element para
</para>
^
index.docbook:2078: element email: validity error : No declaration for element email
mentatie copyright 2005-2006 Rajko Albrecht <email>kdesvn@alwins-world.de</email
^
index.docbook:2079: element para: validity error : No declaration for element para
</para>
^
index.docbook:2082: parser error : Entity 'underFDL' not defined
&underFDL; <!-- FDL: do not remove -->
^
index.docbook:2089: parser error : Entity 'underGPL' not defined
&underGPL; <!-- GPL License -->
^
index.docbook:2093: element sect1: validity error : No declaration for element sect1
</sect1>
^
index.docbook:2095: element appendix: validity error : No declaration for element appendix
</appendix>
^
index.docbook:2097: element appendix: validity error : No declaration for attribute id of element appendix
<appendix id="installation">
^
index.docbook:2098: element title: validity error : No declaration for element title
<title>Installatie</title>
^
index.docbook:2100: element sect1: validity error : No declaration for attribute id of element sect1
<sect1 id="getting-kdesvn">
^
index.docbook:2101: element title: validity error : No declaration for element title
<title>Hoe U &kappname; kunt verkrijgen</title>
^
index.docbook:2106: element ulink: validity error : No declaration for attribute url of element ulink
<ulink url="http://kdesvn.alwins-world.de/downloads/">
^
index.docbook:2107: element ulink: validity error : No declaration for element ulink
de &kappname; download area</ulink>.
^
index.docbook:2108: element para: validity error : No declaration for element para
</para>
^
index.docbook:2110: element ulink: validity error : No declaration for attribute url of element ulink
Op de <ulink url="http://kdesvn.alwins-world.de/browser/trunk">laatste repositor
^
index.docbook:2110: element ulink: validity error : No declaration for element ulink
="http://kdesvn.alwins-world.de/browser/trunk">laatste repository versie</ulink>
^
index.docbook:2111: element para: validity error : No declaration for element para
</para>
^
index.docbook:2113: element ulink: validity error : No declaration for attribute url of element ulink
De homepage van het project is <ulink url="http://kdesvn.alwins-world.de/">http:
^
index.docbook:2113: element ulink: validity error : No declaration for element ulink
ulink url="http://kdesvn.alwins-world.de/">http://kdesvn.alwins-world.de/</ulink
^
index.docbook:2114: element para: validity error : No declaration for element para
</para>
^
index.docbook:2115: element sect1: validity error : No declaration for element sect1
</sect1>
^
index.docbook:2117: element sect1: validity error : No declaration for attribute id of element sect1
<sect1 id="requirements">
^
index.docbook:2118: element title: validity error : No declaration for element title
<title>Benodigde bibliotheken</title>
^
index.docbook:2129: parser error : Entity 'kde' not defined
Subversion 1.2 of moderner en &kde; 3.4.x
^
index.docbook:2131: element para: validity error : No declaration for element para
</para>
^
index.docbook:2133: element ulink: validity error : No declaration for attribute url of element ulink
Subversion kan worden gevonden op <ulink url="http://subversion.tigris.org">its
^
index.docbook:2133: element ulink: validity error : No declaration for element ulink
orden gevonden op <ulink url="http://subversion.tigris.org">its homepage</ulink>
^
index.docbook:2134: element para: validity error : No declaration for element para
</para>
^
index.docbook:2138: element ulink: validity error : No declaration for attribute url of element ulink
url="http://kdesvn.alwins-world.de/browser/trunk/ChangeLog">http://kdesvn.alwins
^
index.docbook:2138: element ulink: validity error : No declaration for element ulink
r/trunk/ChangeLog">http://kdesvn.alwins-world.de/browser/trunk/ChangeLog</ulink>
^
index.docbook:2139: element para: validity error : No declaration for element para
</para>
^
index.docbook:2140: element sect1: validity error : No declaration for element sect1
</sect1>
^
index.docbook:2142: element sect1: validity error : No declaration for attribute id of element sect1
<sect1 id="compilation">
^
index.docbook:2143: element title: validity error : No declaration for element title
<title>Compileren en installeren</title>
^
index.docbook:2146: element para: validity error : No declaration for element para
</para>
^
index.docbook:2149: element prompt: validity error : No declaration for element prompt
<prompt>%</prompt> <userinput><command>mkdir</command> build</userinput>
^
index.docbook:2149: element command: validity error : No declaration for element command
<prompt>%</prompt> <userinput><command>mkdir</command> build</userinput>
^
index.docbook:2149: element userinput: validity error : No declaration for element userinput
<prompt>%</prompt> <userinput><command>mkdir</command> build</userinput>
^
index.docbook:2150: element prompt: validity error : No declaration for element prompt
<prompt>%</prompt> <userinput><command>cd</command> build</userinput>
^
index.docbook:2150: element command: validity error : No declaration for element command
<prompt>%</prompt> <userinput><command>cd</command> build</userinput>
^
index.docbook:2150: element userinput: validity error : No declaration for element userinput
<prompt>%</prompt> <userinput><command>cd</command> build</userinput>
^
index.docbook:2151: element prompt: validity error : No declaration for element prompt
<prompt>%</prompt> <userinput><command>cmake</command> ../ -DCMAKE_INSTALL_PREFI
^
index.docbook:2151: element command: validity error : No declaration for element command
<prompt>%</prompt> <userinput><command>cmake</command> ../ -DCMAKE_INSTALL_PREFI
^
index.docbook:2151: element userinput: validity error : No declaration for element userinput
CMAKE_INSTALL_PREFIX=`kde-config --prefix` -DCMAKE_BUILD_TYPE=Release</userinput
^
index.docbook:2152: element prompt: validity error : No declaration for element prompt
<prompt>%</prompt> <userinput><command>make</command></userinput>
^
index.docbook:2152: element command: validity error : No declaration for element command
<prompt>%</prompt> <userinput><command>make</command></userinput>
^
index.docbook:2152: element userinput: validity error : No declaration for element userinput
<prompt>%</prompt> <userinput><command>make</command></userinput>
^
index.docbook:2153: element prompt: validity error : No declaration for element prompt
<prompt>%</prompt> <userinput><command>make</command> install</userinput>
^
index.docbook:2153: element command: validity error : No declaration for element command
<prompt>%</prompt> <userinput><command>make</command> install</userinput>
^
index.docbook:2153: element userinput: validity error : No declaration for element userinput
<prompt>%</prompt> <userinput><command>make</command> install</userinput>
^
index.docbook:2154: element screen: validity error : No declaration for element screen
</screen>
^
index.docbook:2155: element para: validity error : No declaration for element para
</para>
^
index.docbook:2156: element sect1: validity error : No declaration for element sect1
</sect1>
^
index.docbook:2158: element appendix: validity error : No declaration for element appendix
</appendix>
^
index.docbook:2160: parser error : Entity 'documentation.index' not defined
&documentation.index;
^
index.docbook:2161: element book: validity error : No declaration for element book
</book>
^
make[2]: *** [doc/nl/index.cache.bz2] Error 1
make[1]: *** [doc/nl/CMakeFiles/nl-handbook.dir/all] Error 2
make: *** [all] Error 2

Additional info:
* kdesvn 1.5.5-1

Steps to reproduce:
Try to build it.
This task depends upon

Closed by  Giovanni Scafora (giovanni)
Wednesday, 29 February 2012, 22:56 GMT
Reason for closing:  Fixed

Loading...